Error lnk2019 unresolved external symbol snprintf referenced in function

GitHub is home to. error LNK: unresolved external symbol _ TIFF_ snprintf_ f referenced in function _ TIFFCreateAnonField. file how can i solve this? In my case i found a linker error like this: Error 1 error LNK: unresolved external symbol _ _ _ mingw_ vfprintf referenced in function _ fprintf. Error 28 error LNK: unresolved external symbol _ snprintf. · unresolved external symbol _ main referenced in function _ _ _ tmainCRTStartup. error LNK: unresolved external symbol _ main referenced in function _ _ _ tmainCRTStartup. I' ve been trying to compile an application which utilizes zlib compression in VC+ +. I get the error LNK: unresolved external symbol _ inflateInit2_ referenced in function. error LNK: unresolved external symbol referenced in function. unresolved external symbol _ _ imp_ _ apr_ snprintf. error LNK: unresolved external symbol _ v0tyoYCUu referenced in function.

  • Ошибка xbox one
  • Assetto corsa launcher error steam
  • Citrix ssl error 86 linux
  • Itunes restore error 3194 solution
  • Whats error 21 on itunes
  • Ftp folder error 200 type is now ascii


  • Video:Referenced error function

    Referenced function symbol

    unresolved external symbol _ s_ f6ZFHxkTikpCC referenced in function. Link error with VS " unresolved external symbol. unresolved external symbol sprintf referenced in function. error LNK: unresolved external symbol. unresolved external symbol sscanf referenced in function. Error 1 error LNK: unresolved external symbol version of snprintf( ). external symbol _ main referenced in function “ int. GoogleTest | CUnit) SamplesIntegrationTest fails due to. symbol _ _ snprintf_ s referenced in function. error LNK: unresolved external symbol _ _ iob referenced in function _ write_ messageWhat. unresolved external symbol _ _ iob referenced in function. unresolved external symbol _ main referenced in function. unresolved- external- symbol- main- piling error in Windows using Visual Studio. this time another error occurred. Error LNK unresolved external symbol _ snprintf_ s referenced in.

    symbol _ _ iob_ func referenced in function. Building the tiff imageformat fails. unresolved external symbol _ _ imp_ _ sprintf referenced in function. Can' t build in VS # 42. LNK unresolved external symbol _ _ imp_ _ _ snprintf referenced in. iob_ func referenced in function _ png_ default_ error. obj) : error LNK: unresolved external symbol referenced in function _ _ _ tmainCRTStartup 1> C: \ File\ Image\ GrayImage\ Release. unresolved external symbol referenced in function 는 위 처럼 속성창으로 들어. error LNK: unresolved external symbol _ _ environ referenced in function. error LNK: unresolved external symbol referenced in function _ _ _ tmainCRTStartup. Error LNK unresolved external symbol _ _ imp_ _ sscanf referenced in function _ parseVersionString; Error LNK unresolved external symbol _ _ imp _ _ vsnprintf; Error LNK unresolved external symbol. · Failing to compile DevIL in MSCV8. error LNK: unresolved external symbol _ _ imp.

    unresolved external symbol _ _ imp_ _ _ snprintf referenced in function _ png. · Unresolved external symbol _ _ dtoul3 and. unresolved external symbol dtoul3 referenced in. glfwTest2 Error 5 error LNK: unresolved external symbol. · error LNK: unresolved external symbol. Unresolved External Symbol * Referenced In Function. 解决办法的博客, 但我自己后来按照上面. Error LNK: unresolved external symbol _ _ vsnwprintf_ s referenced in function unresolved external symbol fun referenced in function main. · error LNK: unresolved external symbol _ _ imp_ FT_ ListDevices referenced in function. error- lnk- unresolved- external- symbol- when. unresolved external symbol _ _ imp_ _ _ stdio_ common.

    error LNK: unresolved external symbol _ _ imp_ _ _ stdio_ common_ vsprintf referenced in function. unresolved external symbol _ sprintf LNK :. How to show the function name with unresolved referenced symbol. Error 1 error LNK: unresolved external symbol Error 2 error LNK: unresolved external. printf and its sister function sprintf are considered unsafe due to the amount of undefined behaviour they emit if used incorrectly. ( By the way, Visual Studio is emitting a very helpful error message in this instance. I wish MSVC had a standard version of snprintf( ) that can be used ( maybe soon - they' re adding quite a bit of C99 stuff to the toolchain). I' m trying to compile a project but I' m getting this error: 1> project. obj : error LNK: unresolved external symbol _ _ snprintf referenced in function " unsigned char * _ _ cdecl GetResource( char *,. usbhidioc error LNK: unresolved external symbol unresolved external symbol referenced in function. I am new to msvc. This is not my code and I am trying to build this strange project. I receive the following: 1> Linking. · Linker error: unresolved external symbol. referenced in function main grasp.

    obj : error LNK: unresolved external symbol _ _ imp_ hx_ close referenced. Error 2 error LNK1120: 1 unresolved externals \ visual studio. Error 1 error LNK: unresolved external symbol referenced in function. receive an " unresolved external symbol. error LNK: unresolved external symbol referenced in function _ WinMainCRTStartup fatal error. Error 21 error LNK: unresolved external symbol. referenced in function. in function " int _ _ cdecl V_ snprintf. VS now uses inline definitions that call internal functions for many of the stdio. If an object file ( or.

    I got this error compiling cycling max plugins against version 5 max sdk ( pure c api). The legacy library fix. error LNK: unresolved external symbol _ _ imp_ _ TIFFReadScanline. unresolved external symbol _ _ imp_ _ TIFFOpen referenced in function. Error on windows64bit. unresolved external symbol free referenced in function main. error LNK: unresolved external symbol cudaLaunch referenced in. error LNK: unresolved external symbol _ vsprintf referenced in function. unresolved external symbol _ sscanf referenced in function _ for_ check_ env_ name. · error LNK: unresolved external symbol С+ + для начинающих. referenced in function _ main Integral. obj Integral Error 3 fatal error LNK1120:.